Reaction Details
TargetGlutamate receptor 3
LigandBDBM85740
Substrate/Competitorn/a
Ki 153±n/a nM
CommentsPDSP_773
Citation Sakai, RSwanson, GTShimamoto, KGreen, TContractor, AGhetti, ATamura-Horikawa, YOiwa, CKamiya, H Pharmacological properties of the potent epileptogenic amino acid dysiherbaine, a novel glutamate receptor agonist isolated from the marine sponge Dysidea herbacea. J Pharmacol Exp Ther296:650-8 (2001) Glutamate receptor 3
Name:Glutamate receptor 3
Type:Enzyme Catalytic Domain
Mol. Mass.:100383.57
Organism:RAT
Description:Glutamate-AMPA GRIA3 RAT::P19492
Residue:888
BDBM85740
NameBDBM85740
Synonyms:Dysiherbaine
TypeSmall organic molecule
Emp. Form.C12H20N2O7
Mol. Mass.304.2964
SMILESCN[C@H]1[C@H]2O[C@](C[C@H](N)C(O)=O)(C[C@H]2OC[C@H]1O)C(O)=O