Reaction Details
TargetHistamine H3 receptor
LigandBDBM22884
Substrate/Competitorn/a
Ki 67±n/a nM
CommentsPDSP_975
Citation Liu, CMa, XJiang, XWilson, SJHofstra, CLBlevitt, JPyati, JLi, XChai, WCarruthers, NLovenberg, TW Cloning and pharmacological characterization of a fourth histamine receptor (H(4)) expressed in bone marrow. Mol Pharmacol59:420-6 (2001) 
 
Histamine H3 receptor
Name:Histamine H3 receptor
Type:G Protein-Coupled Receptor (GPCR)
Mol. Mass.:48691.47
Organism:Homo sapiens (Human)
Description:Binding assays were using CHO cells stably expressing hH3R receptors.
Residue:445
BDBM22884
NameBDBM22884
Synonyms:2-[3-(1H-imidazol-5-yl)propyl]-1-(2-{[(5-methyl-1H-imidazol-4-yl)methyl]sulfanyl}ethyl)guanidine Impromidine
TypeSmall organic molecule
Emp. Form.C14H23N7S
Mol. Mass.321.444
SMILESCc1nc[nH]c1CSCCN=C(N)NCCCc1cnc[nH]1