Reaction Details
TargetMuscarinic acetylcholine receptor M2
LigandBDBM85787
Substrate/Competitorn/a
Ki 540±n/a nM
CommentsPDSP_214
Citation Hirose, HAoki, IKimura, TFujikawa, TNumazawa, TSasaki, KSato, AHasegawa, TNishikibe, MMitsuya, MOhtake, NMase, TNoguchi, K Pharmacological properties of (2R)-N-[1-(6-aminopyridin-2-ylmethyl)piperidin-4-yl]-2-[(1R)-3,3-difluorocyclopentyl]-2-hydroxy-2-phenylacetamide: a novel mucarinic antagonist with M(2)-sparing antagonistic activity. J Pharmacol Exp Ther297:790-7 (2001) Muscarinic acetylcholine receptor M2
Name:Muscarinic acetylcholine receptor M2
Type:GPCR
Mol. Mass.:51730.61
Organism:Homo sapiens (Human)
Description:P08172
Residue:466
BDBM85787
NameBDBM85787
Synonyms:Compound A
TypeSmall organic molecule
Emp. Form.C23H29F2N4O3
Mol. Mass.447.4982
SMILESNc1cocc(CN2CCC(CC2)NC(=O)[C@@](O)([C@@H]2CCC(F)(F)C2)c2ccccc2)n1