Reaction Details
TargetMuscarinic acetylcholine receptor M5
LigandBDBM86231
Substrate/Competitorn/a
Ki 0.54±n/a nM
CommentsPDSP_334
Citation Hirose, HAoki, IKimura, TFujikawa, TNumazawa, TSasaki, KSato, AHasegawa, TNishikibe, MMitsuya, MOhtake, NMase, TNoguchi, K Pharmacological properties of (2R)-N-[1-(6-aminopyridin-2-ylmethyl)piperidin-4-yl]-2-[(1R)-3,3-difluorocyclopentyl]-2-hydroxy-2-phenylacetamide: a novel mucarinic antagonist with M(2)-sparing antagonistic activity. J Pharmacol Exp Ther297:790-7 (2001) Muscarinic acetylcholine receptor M5
Name:Muscarinic acetylcholine receptor M5
Type:PROTEIN
Mol. Mass.:60102.35
Organism:Homo sapiens (Human)
Description:ChEMBL_1517990
Residue:532
BDBM86231
NameBDBM86231
Synonyms:ATR Atropine,(-) CHEMBL195 US9333195, ATROPINE
TypeSmall organic molecule
Emp. Form.C17H23NO3
Mol. Mass.289.3694
SMILESCN1C2CCC1CC(C2)OC(=O)C(CO)c1ccccc1