Reaction Details
TargetGlutamate receptor 3
LigandBDBM50004863
Substrate/Competitorn/a
Ki>10000±n/a nM
CommentsPDSP_96
Citation Wright, RAArnold, MBWheeler, WJOrnstein, PLSchoepp, DD [3H]LY341495 binding to group II metabotropic glutamate receptors in rat brain. J Pharmacol Exp Ther298:453-60 (2001) Glutamate receptor 3
Name:Glutamate receptor 3
Type:Enzyme Catalytic Domain
Mol. Mass.:100383.57
Organism:RAT
Description:Glutamate-AMPA GRIA3 RAT::P19492
Residue:888
BDBM50004863
NameBDBM50004863
Synonyms:(+/-)-trans-ACPD (1S,3S)-1-aminocyclopentane-1,3-dicarboxylic acid 1-Amino-cyclopentane-1,3-dicarboxylic acid(cis-(1S,3S)-ACPD) 1R,3S-ACPD CHEMBL29726
TypeSmall organic molecule
Emp. Form.C7H11NO4
Mol. Mass.173.1665
SMILESN[C@]1(CC[C@@H](C1)C(O)=O)C(O)=O