Reaction Details
TargetMuscarinic acetylcholine receptor M3
LigandBDBM85817
Substrate/Competitorn/a
Ki 4.68±n/a nM
CommentsPDSP_2071
Citation Christopoulos, AGrant, MKAyoubzadeh, NKim, ONSauerberg, PJeppesen, LEl-Fakahany, EE Synthesis and pharmacological evaluation of dimeric muscarinic acetylcholine receptor agonists. J Pharmacol Exp Ther298:1260-8 (2001) Muscarinic acetylcholine receptor M3
Name:Muscarinic acetylcholine receptor M3
Type:Enzyme
Mol. Mass.:66151.03
Organism:Homo sapiens (Human)
Description:P20309
Residue:590
BDBM85817
NameBDBM85817
Synonyms:NNC 11-1585
TypeSmall organic molecule
Emp. Form.C30H32N6O2S2
Mol. Mass.572.744
SMILESC(Oc1nsnc1C1CN2CCC1CC2)C#Cc1ccc(cc1)C#CCOc1nsnc1C1CN2CCC1CC2