Reaction Details
Target5-hydroxytryptamine receptor 1B
LigandBDBM82071
Substrate/Competitorn/a
Ki>10000±n/a nM
CommentsPDSP_1947
Citation Bymaster, FPDreshfield-Ahmad, LJThrelkeld, PGShaw, JLThompson, LNelson, DLHemrick-Luecke, SKWong, DT Comparative affinity of duloxetine and venlafaxine for serotonin and norepinephrine transporters in vitro and in vivo, human serotonin receptor subtypes, and other neuronal receptors. Neuropsychopharmacology25:871-80 (2001) 
 
5-hydroxytryptamine receptor 1B
Name:5-hydroxytryptamine receptor 1B
Type:G Protein-Coupled Receptor (GPCR)
Mol. Mass.:43579.17
Organism:Homo sapiens (Human)
Description:Receptor binding assays were performed using human clone stably expressed in CHO cells
Residue:390
BDBM82071
NameBDBM82071
Synonyms:CAS_93413-69-5 NSC_62923 Venlafaxine hydrochloride WY-45655
TypeSmall organic molecule
Emp. Form.C17H27NO2
Mol. Mass.277.4018
SMILESCOc1ccc(cc1)C(CN(C)C)C1(O)CCCCC1