Reaction Details
TargetSodium/nucleoside cotransporter
LigandBDBM82071
Substrate/Competitorn/a
Ki 1000±n/a nM
CommentsPDSP_1947
Citation Bymaster, FPDreshfield-Ahmad, LJThrelkeld, PGShaw, JLThompson, LNelson, DLHemrick-Luecke, SKWong, DT Comparative affinity of duloxetine and venlafaxine for serotonin and norepinephrine transporters in vitro and in vivo, human serotonin receptor subtypes, and other neuronal receptors. Neuropsychopharmacology25:871-80 (2001) 
 
Sodium/nucleoside cotransporter
Name:Sodium/nucleoside cotransporter
Synonyms:Adenosine transporter
Type:Enzyme Catalytic Domain
Mol. Mass.:72613.74
Organism:RAT
Description:Adenosine transporter 0 RAT::Q91WW8
Residue:659
BDBM82071
NameBDBM82071
TypeSmall organic molecule
Emp. Form.C17H27NO2
Mol. Mass.277.4018
SMILESCOc1ccc(cc1)C(CN(C)C)C1(O)CCCCC1