Reaction Details
TargetCalcium-activated potassium channel subunit beta-1
LigandBDBM82071
Substrate/Competitorn/a
Ki 1000±n/a nM
CommentsPDSP_1947
Citation Bymaster, FPDreshfield-Ahmad, LJThrelkeld, PGShaw, JLThompson, LNelson, DLHemrick-Luecke, SKWong, DT Comparative affinity of duloxetine and venlafaxine for serotonin and norepinephrine transporters in vitro and in vivo, human serotonin receptor subtypes, and other neuronal receptors. Neuropsychopharmacology25:871-80 (2001) 
 
Calcium-activated potassium channel subunit beta-1
Name:Calcium-activated potassium channel subunit beta-1
Type:Enzyme Catalytic Domain
Mol. Mass.:21917.35
Organism:RAT
Description:Potassium Channel (Ca2+ dependent) 0 RAT::P97678
Residue:191
BDBM82071
NameBDBM82071
Synonyms:CAS_93413-69-5 NSC_62923 Venlafaxine hydrochloride WY-45655
TypeSmall organic molecule
Emp. Form.C17H27NO2
Mol. Mass.277.4018
SMILESCOc1ccc(cc1)C(CN(C)C)C1(O)CCCCC1