Reaction Details
TargetNeurotensin receptor type 2
LigandBDBM50240339
Substrate/Competitorn/a
Ki 3.8±n/a nM
CommentsPDSP_3751
Citation Pettibone, DJHess, JFHey, PJJacobson, MALeviten, MLis, EVMallorga, PJPascarella, DMSnyder, MAWilliams, JBZeng, Z The effects of deleting the mouse neurotensin receptor NTR1 on central and peripheral responses to neurotensin. J Pharmacol Exp Ther300:305-13 (2002) 
 
Neurotensin receptor type 2
Name:Neurotensin receptor type 2
Type:Enzyme Catalytic Domain
Mol. Mass.:46391.18
Organism:MOUSE
Description:P70310
Residue:416
BDBM50240339
NameBDBM50240339
Synonyms:(S)-2-((S)-2-((S)-2-((S)-1-((S)-6-amino-2-((S)-5-guanidino-2-(methylamino)pentanamido)hexanoyl)pyrrolidine-2-carboxamido)-3-(1H-indol-3-yl)propanamido)-3,3-dimethylbutanamido)-4-methylpentanoic acid CHEMBL266571 | Neurotensin 2
TypeSmall organic molecule
Emp. Form.C41H67N11O7
Mol. Mass.826.0402
SMILESCN[C@@H](CCCN=C(N)N)C(=O)N[C@@H](CCCCN)C(=O)N1CCC[C@H]1C(=O)N[C@@H](Cc1c[nH]c2ccccc12)C(=O)N[C@H](C(=O)N[C@@H](CC(C)C)C(O)=O)C(C)(C)C