Reaction Details
TargetHistamine H1 receptor
LigandBDBM50292411
Substrate/Competitorn/a
Ki 1.11±n/a nM
CommentsPDSP_1917
Citation Booth, RGMoniri, NHBakker, RAChoksi, NYNix, WBTimmerman, HLeurs, R A novel phenylaminotetralin radioligand reveals a subpopulation of histamine H(1) receptors. J Pharmacol Exp Ther302:328-36 (2002) 
 
Histamine H1 receptor
Name:Histamine H1 receptor
Type:G Protein-Coupled Receptor (GPCR)
Mol. Mass.:55808.72
Organism:Homo sapiens (Human)
Description:Cell pellets from SK-N-MC cells transfected with human H1 receptor were used in binding assay.
Residue:487
BDBM50292411
NameBDBM50292411
Synonyms:(E)-2-(3-(pyrrolidin-1-yl)-1-p-tolylprop-1-enyl)pyridine 2-((E)-3-Pyrrolidin-1-yl-1-p-tolyl-propenyl)-pyridine 2-(3-Pyrrolidin-1-yl-1-p-tolyl-propenyl)-pyridine Actidil Allerfed Corphed Myfed TRIPROLIDINE Trilitron Triprolidin
TypeSmall organic molecule
Emp. Form.C19H22N2
Mol. Mass.278.3914
SMILESCc1ccc(cc1)C(=C/CN1CCCC1)\c1ccccn1