Reaction Details
TargetL-lactate dehydrogenase A chain
LigandBDBM23251
Substrate/Competitorn/a
Meas. Tech.Enzyme Assay
pH7.5±0
Temperature294.15±0 K
IC50 4.50e+5±n/a nM
Citation Ward, RABrassington, CBreeze, ALCaputo, ACritchlow, SDavies, GGoodwin, LHassall, GGreenwood, RHoldgate, GAMrosek, MNorman, RAPearson, STart, JTucker, JAVogtherr, MWhittaker, DWingfield, JWinter, JHudson, K Design and synthesis of novel lactate dehydrogenase a inhibitors by fragment-based lead generation. J Med Chem55:3285-306 (2012) 
 
L-lactate dehydrogenase A chain
Name:L-lactate dehydrogenase A chain
Type:Protein
Mol. Mass.:36694.85
Organism:Homo sapiens (Human)
Description:P00338::PDB Code: 4ajp
Residue:332
BDBM23251
NameBDBM23251
Synonyms:1,2,5-Thiadiazole, TDA1 LDHA Inhibitor, 1
TypeSmall organic molecule
Emp. Form.C3H2N2O3S
Mol. Mass.146.125
SMILESOC(=O)c1ns[nH]c1=O