Reaction Details
TargetL-lactate dehydrogenase A chain
LigandBDBM86118
Substrate/Competitorn/a
Meas. Tech.Enzyme Assay
pH7.5±0
Temperature294.15±0 K
IC50>5.00e+5±n/a nM
Citation Ward, RABrassington, CBreeze, ALCaputo, ACritchlow, SDavies, GGoodwin, LHassall, GGreenwood, RHoldgate, GAMrosek, MNorman, RAPearson, STart, JTucker, JAVogtherr, MWhittaker, DWingfield, JWinter, JHudson, K Design and synthesis of novel lactate dehydrogenase a inhibitors by fragment-based lead generation. J Med Chem55:3285-306 (2012) 
 
L-lactate dehydrogenase A chain
Name:L-lactate dehydrogenase A chain
Type:Protein
Mol. Mass.:36456.12
Organism:Rattus norvegicus (Rat)
Description:P04642::PDB Codes: 4ajl, 4aj2, 4aje, 4aji, 4ajk, 4ajh, 4ajl, 4al4, 4ajh, 4ajo
Residue:332
BDBM86118
NameBDBM86118
Synonyms:LDHA Inhibitor, 13
TypeSmall organic molecule
Emp. Form.C10H9NO3S
Mol. Mass.223.248
SMILESNS(=O)(=O)c1ccc(O)c2ccccc12