Reaction Details
TargetMetabotropic glutamate receptor 4
LigandBDBM50004051
Substrate/Competitorn/a
Ki 398.11±n/a nM
CommentsPDSP_3126
Citation Shi, QSavage, JEHufeisen, SJRauser, LGrajkowska, EErnsberger, PWroblewski, JTNadeau, JHRoth, BL L-homocysteine sulfinic acid and other acidic homocysteine derivatives are potent and selective metabotropic glutamate receptor agonists. J Pharmacol Exp Ther305:131-42 (2003) 
 
Metabotropic glutamate receptor 4
Name:Metabotropic glutamate receptor 4
Type:Enzyme
Mol. Mass.:101849.79
Organism:Rattus norvegicus (Rat)
Description:P31423
Residue:912
BDBM50004051
NameBDBM50004051
Synonyms:2-Amino-4-phosphono-butyric acid 4-Amino Phosphonobutyrate GlcN-6-P synthase inhibitor, 1 (racemic mixture) | L-AP4
TypeSmall organic molecule
Emp. Form.C4H10NO5P
Mol. Mass.183.0997
SMILESNC(CCP(O)(O)=O)C(O)=O