Reaction Details
TargetNeuronal acetylcholine receptor subunit alpha-4
LigandBDBM50004108
Substrate/Competitorn/a
Ki 4.6±n/a nM
CommentsPDSP_1311
Citation Cohen, CBergis, OEGalli, FLochead, AWJegham, SBiton, BLeonardon, JAvenet, PSgard, FBesnard, FGraham, DCoste, AOblin, ACuret, OVoltz, CGardes, ACaille, DPerrault, GGeorge, PSoubrie, PScatton, B SSR591813, a novel selective and partial alpha4beta2 nicotinic receptor agonist with potential as an aid to smoking cessation. J Pharmacol Exp Ther306:407-20 (2003) 
 
Neuronal acetylcholine receptor subunit alpha-4
Name:Neuronal acetylcholine receptor subunit alpha-4
Type:n/a
Mol. Mass.:69963.49
Organism:Homo sapiens (Human)
Description:NACHRA4
Residue:627
BDBM50004108
NameBDBM50004108
Synonyms:(+-)-nicotine (RS)-nicotine CHEMBL440464 Nicotine-(+) US11667638, Example Nicotine US9284322, Nicotine nicotine
TypeSmall organic molecule
Emp. Form.C10H14N2
Mol. Mass.162.2316
SMILESCN1CCCC1c1cccnc1