Reaction Details
TargetMetabotropic glutamate receptor 1
LigandBDBM86212
Substrate/Competitorn/a
Ki 1.92±n/a nM
CommentsPDSP_96
Citation Lavreysen, HJanssen, CBischoff, FLanglois, XLeysen, JELesage, AS [3H]R214127: a novel high-affinity radioligand for the mGlu1 receptor reveals a common binding site shared by multiple allosteric antagonists. Mol Pharmacol63:1082-93 (2003) 
 
Metabotropic glutamate receptor 1
Name:Metabotropic glutamate receptor 1
Type:Enzyme Catalytic Domain
Mol. Mass.:133240.47
Organism:RAT
Description:metabotropic glutamate 1/2 0 RAT::P23385
Residue:1199
BDBM86212
NameBDBM86212
Synonyms:1S, 3R-ACPD NSC_104766
TypeSmall organic molecule
Emp. Form.C7H11NO4
Mol. Mass.173.1665
SMILESNC1(CCC(C1)C(O)=O)C(O)=O