Reaction Details
TargetPyroglutamylated RF-amide peptide receptor
LigandBDBM86225
Substrate/Competitorn/a
Ki 1500±n/a nM
CommentsPDSP_7188
Citation Jiang, YLuo, LGustafson, ELYadav, DLaverty, MMurgolo, NVassileva, GZeng, MLaz, TMBehan, JQiu, PWang, LWang, SBayne, MGreene, JMonsma, FZhang, FL Identification and characterization of a novel RF-amide peptide ligand for orphan G-protein-coupled receptor SP9155. J Biol Chem278:27652-7 (2003) 
 
Pyroglutamylated RF-amide peptide receptor
Name:Pyroglutamylated RF-amide peptide receptor
Type:Enzyme Catalytic Domain
Mol. Mass.:49508.46
Organism:Homo sapiens (Human)
Description:GPR103 0 HUMAN::Q96P65
Residue:431
BDBM86225
NameBDBM86225
Synonyms:P51
TypeSmall organic molecule
Emp. Form.C49H72N18O11S
Mol. Mass.1121.275
SMILESC[C@H](NC(=O)[C@H](Cc1cnc[nH]1)NC(=O)[C@@H](N)CCC(O)=O)C(=O)NCC(=O)N[C@@H](CS)C(=O)N[C@@H](CCCN=C(N)N)C(=O)N[C@@H](Cc1ccccc1)C(=O)N[C@@H](CCCN=C(N)N)C(=O)NC(Cc1ccccc1)C(N)=O