Reaction Details
TargetCalcium-activated potassium channel subunit beta
LigandBDBM86250
Substrate/Competitorn/a
Ki 10.5±n/a nM
CommentsPDSP_3709
Citation Davis-Taber, RMolinari, EJAltenbach, RJWhiteaker, KLShieh, CCRotert, GBuckner, SAMalysz, JMilicic, IMcDermott, JSGintant, GACoghlan, MJCarroll, WAScott, VEGopalakrishnan, M [125I]A-312110, a novel high-affinity 1,4-dihydropyridine ATP-sensitive K+ channel opener: characterization and pharmacology of binding. Mol Pharmacol64:143-53 (2003) 
 
Calcium-activated potassium channel subunit beta
Name:Calcium-activated potassium channel subunit beta
Synonyms:Potassium channel (ATP modulatory)
Type:Enzyme Catalytic Domain
Mol. Mass.:22836.62
Organism:GUINEA PIG
Description:C0KY85
Residue:199
BDBM86250
NameBDBM86250
TypeSmall organic molecule
Emp. Form.C12H17N5
Mol. Mass.231.2969
SMILESCCC(C)(C)N=C(NC#N)Nc1cccnc1