Reaction Details
TargetfMet-Leu-Phe receptor
LigandBDBM86306
Substrate/Competitorn/a
Ki 323±n/a nM
CommentsPDSP_3271
Citation Bae, YSSong, JYKim, YHe, RYe, RDKwak, JYSuh, PGRyu, SH Differential activation of formyl peptide receptor signaling by peptide ligands. Mol Pharmacol64:841-7 (2003) 
 
fMet-Leu-Phe receptor
Name:fMet-Leu-Phe receptor
Type:Enzyme Catalytic Domain
Mol. Mass.:38456.14
Organism:Homo sapiens (Human)
Description:gi_4503779
Residue:350
BDBM86306
NameBDBM86306
Synonyms:WEYMVm-NH2
TypeSmall organic molecule
Emp. Form.C40H56N8O9S2
Mol. Mass.857.051
SMILESCSCC[C@@H](NC(=O)[C@@H](NC(=O)[C@H](CCSC)NC(=O)[C@H](Cc1ccc(O)cc1)NC(=O)[C@@H](CCC(O)=O)NC(=O)[C@@H](N)Cc1c[nH]c2ccccc12)C(C)C)C(N)=O