Reaction Details
TargetSodium-dependent serotonin transporter
LigandBDBM86421
Substrate/Competitorn/a
Ki 0.9±n/a nM
CommentsPDSP_1710
Citation Koch, SHemrick-Luecke, SKThompson, LKEvans, DCThrelkeld, PGNelson, DLPerry, KWBymaster, FP Comparison of effects of dual transporter inhibitors on monoamine transporters and extracellular levels in rats. Neuropharmacology45:935-44 (2003) 
 
Sodium-dependent serotonin transporter
Name:Sodium-dependent serotonin transporter
Type:Multi-pass membrane protein
Mol. Mass.:70322.51
Organism:Homo sapiens (Human)
Description:P31645
Residue:630
BDBM86421
NameBDBM86421
Synonyms:CAS_79617-96-2 SERTRALINE
TypeSmall organic molecule
Emp. Form.C17H17Cl2N
Mol. Mass.306.23
SMILESCNC1CCC(c2ccc(Cl)c(Cl)c2)c2ccccc12