Reaction Details
TargetSodium-dependent dopamine transporter
LigandBDBM77970
Substrate/Competitorn/a
Ki 2190±n/a nM
CommentsPDSP_510
Citation Koch, SHemrick-Luecke, SKThompson, LKEvans, DCThrelkeld, PGNelson, DLPerry, KWBymaster, FP Comparison of effects of dual transporter inhibitors on monoamine transporters and extracellular levels in rats. Neuropharmacology45:935-44 (2003) 
 
Sodium-dependent dopamine transporter
Name:Sodium-dependent dopamine transporter
Type:Multi-pass membrane protein
Mol. Mass.:68497.11
Organism:Homo sapiens (Human)
Description:Q01959
Residue:620
BDBM77970
NameBDBM77970
Synonyms:3-(2-chloranyl-5,6-dihydrobenzo[b][1]benzazepin-11-yl)-N,N-dimethyl-propan-1-amine;hydrochloride 3-(2-chloro-5,6-dihydrobenzo[b][1]benzazepin-11-yl)-N,N-dimethylpropan-1-amine;hydrochloride CHLORIMIPRAMINE CLOMIPRAMINE HYDROCHLORIDE MLS000028511 cid_68539 | med.21724, Compound Clomipramine
TypeSmall organic molecule
Emp. Form.C19H23ClN2
Mol. Mass.314.852
SMILESCN(C)CCCN1c2ccccc2CCc2ccc(Cl)cc12