Reaction Details
TargetDelta-type opioid receptor
LigandBDBM86260
Substrate/Competitorn/a
Ki 488±n/a nM
CommentsPDSP_1282
Citation Valenzano, KJMiller, WChen, ZShan, SCrumley, GVictory, SFDavies, EHuang, JCAllie, NNolan, SJRotshteyn, YKyle, DJBroglé, K DiPOA ([8-(3,3-diphenyl-propyl)-4-oxo-1-phenyl-1,3,8-triazaspiro[4.5]dec-3-yl]-acetic acid), a novel, systemically available, and peripherally restricted mu opioid agonist with antihyperalgesic activity: I. In vitro pharmacological characterization and pharmacokinetic properties. J Pharmacol Exp Ther310:783-92 (2004) 
 
Delta-type opioid receptor
Name:Delta-type opioid receptor
Type:G Protein-Coupled Receptor (GPCR)
Mol. Mass.:40382.98
Organism:Homo sapiens (Human)
Description:Competition binding assays were carried out using membrane preparations from transfected HN9.10 cells that constitutively expressed the delta opioid receptor.
Residue:372
BDBM86260
NameBDBM86260
Synonyms:CAS_465-65-6 NSC_10064 | Naloxone(-)
TypeSmall organic molecule
Emp. Form.C19H21NO4
Mol. Mass.327.3743
SMILESOc1ccc2CC3N(CC=C)CCC45C(Oc1c24)C(=O)CCC35O