Reaction Details
TargetMu-type opioid receptor
LigandBDBM86493
Substrate/Competitorn/a
Ki 2.39±n/a nM
CommentsPDSP_2945
Citation Valenzano, KJMiller, WChen, ZShan, SCrumley, GVictory, SFDavies, EHuang, JCAllie, NNolan, SJRotshteyn, YKyle, DJBroglé, K DiPOA ([8-(3,3-diphenyl-propyl)-4-oxo-1-phenyl-1,3,8-triazaspiro[4.5]dec-3-yl]-acetic acid), a novel, systemically available, and peripherally restricted mu opioid agonist with antihyperalgesic activity: I. In vitro pharmacological characterization and pharmacokinetic properties. J Pharmacol Exp Ther310:783-92 (2004) 
 
Mu-type opioid receptor
Name:Mu-type opioid receptor
Type:G Protein-Coupled Receptor (GPCR)
Mol. Mass.:44789.51
Organism:Homo sapiens (Human)
Description:P35372
Residue:400
BDBM86493
NameBDBM86493
Synonyms:CAS_27943 NSC_27943 | Naltrexone
TypeSmall organic molecule
Emp. Form.C20H23NO4
Mol. Mass.341.4009
SMILESOc1ccc2CC3N(CC4CC4)CCC45C(Oc1c24)C(=O)CCC35O