Reaction Details
TargetSphingosine 1-phosphate receptor 4
LigandBDBM22202
Substrate/Competitorn/a
Ki 27±n/a nM
CommentsPDSP_3978
Citation Fossetta, JDeno, GGonsiorek, WFan, XLavey, BDas, PLunn, CZavodny, PJLundell, DHipkin, RW Pharmacological characterization of human S1P4 using a novel radioligand, [4,5-3H]-dihydrosphingosine-1-phosphate. Br J Pharmacol142:851-60 (2004) 
 
Sphingosine 1-phosphate receptor 4
Name:Sphingosine 1-phosphate receptor 4
Type:G Protein-Coupled Receptor (GPCR)
Mol. Mass.:41647.39
Organism:Homo sapiens (Human)
Description:n/a
Residue:384
BDBM22202
NameBDBM22202
Synonyms:S1P [33P]S1P sphingosine-1-phosphate, 32P labeled {[(4Z)-2-amino-3-hydroxyoctadec-4-en-1-yl]oxy}phosphonic acid
Typeradiolabeled ligand
Emp. Form.C18H38NO5P
Mol. Mass.379.4718
SMILESCCCCCCCCCCCCC\C=C/C(O)C(N)COP(O)(O)=O