Reaction Details
TargetHistamine H4 receptor
LigandBDBM22914
Substrate/Competitorn/a
Ki 79.43±n/a nM
CommentsPDSP_1847
Citation Barbier, AJBerridge, CDugovic, CLaposky, ADWilson, SJBoggs, JAluisio, LLord, BMazur, CPudiak, CMLanglois, XXiao, WApodaca, RCarruthers, NILovenberg, TW Acute wake-promoting actions of JNJ-5207852, a novel, diamine-based H3 antagonist. Br J Pharmacol143:649-61 (2004) 
 
Histamine H4 receptor
Name:Histamine H4 receptor
Type:G Protein-Coupled Receptor (GPCR)
Mol. Mass.:44517.02
Organism:Homo sapiens (Human)
Description:Binding assays were using CHO cells stably expressing hH4R receptors.
Residue:390
BDBM22914
NameBDBM22914
Synonyms:CHEMBL260374 Thioperamide | US11622967, Compound Thioperamide
TypeSmall organic molecule
Emp. Form.C15H24N4S
Mol. Mass.292.443
SMILESS=C(NC1CCCCC1)N1CCC(CC1)c1cnc[nH]1