Reaction Details
TargetHistamine receptor H3
LigandBDBM27213
Substrate/Competitorn/a
Ki 5.75±n/a nM
CommentsPDSP_2989
Citation Esbenshade, TAFox, GBKrueger, KMMiller, TRKang, CHDenny, LIWitte, DGYao, BBPan, LWetter, JMarsh, KBennani, YLCowart, MDSullivan, JPHancock, AA Pharmacological properties of ABT-239 [4-(2-{2-[(2R)-2-Methylpyrrolidinyl]ethyl}-benzofuran-5-yl)benzonitrile]: I. Potent and selective histamine H3 receptor antagonist with drug-like properties. J Pharmacol Exp Ther313:165-75 (2005) 
 
Histamine receptor H3
Name:Histamine receptor H3
Type:Enzyme Catalytic Domain
Mol. Mass.:16901.59
Organism:Dog
Description:Q865E3
Residue:147
BDBM27213
NameBDBM27213
Synonyms:4-[3-(4-cyclopropanecarbonylphenoxy)propyl]-1H-imidazole CHEMBL1795025 | Ciproxifan
TypeSmall organic molecule
Emp. Form.C16H18N2O2
Mol. Mass.270.3263
SMILESO=C(C1CC1)c1ccc(OCCCc2cnc[nH]2)cc1