Reaction Details
TargetGlucocorticoid receptor
LigandBDBM86694
Substrate/Competitorn/a
Ki>10000±n/a nM
CommentsPDSP_4918
Citation Miyata, NSeki, TTanaka, YOmura, TTaniguchi, KDoi, MBandou, KKametani, SSato, MOkuyama, SCambj-Sapunar, LHarder, DRRoman, RJ Beneficial effects of a new 20-hydroxyeicosatetraenoic acid synthesis inhibitor, TS-011 [N-(3-chloro-4-morpholin-4-yl) phenyl-N'-hydroxyimido formamide], on hemorrhagic and ischemic stroke. J Pharmacol Exp Ther314:77-85 (2005) 
 
Glucocorticoid receptor
Name:Glucocorticoid receptor
Type:Enzyme Catalytic Domain
Mol. Mass.:86050.26
Organism:MOUSE
Description:Glucocorticoid 0 MOUSE::P06537
Residue:783
BDBM86694
NameBDBM86694
Synonyms:N'-(3-Chloro-4-morpholinophenyl)-N-hydroxyformamidine | TS-011
TypeSmall organic molecule
Emp. Form.C11H14ClN3O2
Mol. Mass.255.701
SMILESONC=Nc1ccc(N2CCOCC2)c(Cl)c1