Reaction Details
TargetTyrosine-protein kinase ABL1
LigandBDBM86859
Substrate/Competitorn/a
Ki 47±n/a nM
CommentsPDSP_8422
Citation Radi, MCrespan, EBotta, GFalchi, FMaga, GManetti, FCorradi, VMancini, MSantucci, MASchenone, SBotta, M Discovery and SAR of 1,3,4-thiadiazole derivatives as potent Abl tyrosine kinase inhibitors and cytodifferentiating agents. Bioorg Med Chem Lett18:1207-11 (2008) 
 
Tyrosine-protein kinase ABL1
Name:Tyrosine-protein kinase ABL1
Type:Enzyme
Mol. Mass.:122897.30
Organism:Homo sapiens (Human)
Description:P00519
Residue:1130
BDBM86859
NameBDBM86859
Synonyms:CAS_1327207 NSC_1327207
TypeSmall organic molecule
Emp. Form.C16H11BrClN3OS2
Mol. Mass.440.765
SMILESClc1ccc(cc1)C(=O)Nc1nnc(SCc2ccc(Br)cc2)s1