Reaction Details
TargetNeuronal acetylcholine receptor subunit alpha-7
LigandBDBM91601
Substrate/Competitorn/a
Meas. Tech.Synthesizing Selective Agonists for the ?7 Nicotinic Receptor with in situ Click-Chemistry on Acetylcholine Binding Protein Templates.
pH7.4±n/a
Temperature310.15±n/a K
EC50 2900±n/a nM
Citation Yamauchi, JGGomez, KGrimster, NDufouil, MNemecz, AFotsing, JRHo, KTalley, TTSharpless, KFokin, VVTaylor, P Synthesizing Selective Agonists for the ?7 Nicotinic Receptor with in situ Click-Chemistry on Acetylcholine Binding Protein Templates. Mol Pharmacol82:687-699 (2014) 
 
Neuronal acetylcholine receptor subunit alpha-7
Name:Neuronal acetylcholine receptor subunit alpha-7
Type:n/a
Mol. Mass.:56448.33
Organism:Homo sapiens (Human)
Description: CHRNA7 (NACHRA7)
Residue:502
BDBM91601
NameBDBM91601
Synonyms:3' | alpha7 agonists 3'
Typen/a
Emp. Form.C21H26N5O2
Mol. Mass.380.4629
SMILESO=c1cc(OCc2cnnn2CC[N+]23CCC(CC2)CC3)c2ccccc2[nH]1