Reaction Details
TargetNeuronal acetylcholine receptor subunit alpha-4
LigandBDBM91603
Substrate/Competitorn/a
Meas. Tech.Synthesizing Selective Agonists for the ?7 Nicotinic Receptor with in situ Click-Chemistry on Acetylcholine Binding Protein Templates.
pH7.4±n/a
Temperature310.15±n/a K
Ki 23000±n/a nM
Citation Yamauchi, JGGomez, KGrimster, NDufouil, MNemecz, AFotsing, JRHo, KTalley, TTSharpless, KFokin, VVTaylor, P Synthesizing Selective Agonists for the ?7 Nicotinic Receptor with in situ Click-Chemistry on Acetylcholine Binding Protein Templates. Mol Pharmacol82:687-699 (2014) 
 
Neuronal acetylcholine receptor subunit alpha-4
Name:Neuronal acetylcholine receptor subunit alpha-4
Type:n/a
Mol. Mass.:69963.49
Organism:Homo sapiens (Human)
Description:NACHRA4
Residue:627
BDBM91603
NameBDBM91603
Synonyms:4' | alpha7 agonists 4'
Typen/a
Emp. Form.C22H30N5O
Mol. Mass.380.506
SMILESCN1CC=C(OCc2cnnn2C2CC3CCC(C2)[N+]3(C)C)c2ccccc12