Reaction Details
TargetNeuronal acetylcholine receptor subunit alpha-7
LigandBDBM91615
Substrate/Competitorn/a
Meas. Tech.Synthesizing Selective Agonists for the ?7 Nicotinic Receptor with in situ Click-Chemistry on Acetylcholine Binding Protein Templates.
pH7.4±n/a
Temperature310.15±n/a K
EC50 200±n/a nM
Citation Yamauchi, JGGomez, KGrimster, NDufouil, MNemecz, AFotsing, JRHo, KTalley, TTSharpless, KFokin, VVTaylor, P Synthesizing Selective Agonists for the ?7 Nicotinic Receptor with in situ Click-Chemistry on Acetylcholine Binding Protein Templates. Mol Pharmacol82:687-699 (2014) 
 
Neuronal acetylcholine receptor subunit alpha-7
Name:Neuronal acetylcholine receptor subunit alpha-7
Type:n/a
Mol. Mass.:56448.33
Organism:Homo sapiens (Human)
Description: CHRNA7 (NACHRA7)
Residue:502
BDBM91615
NameBDBM91615
Synonyms:15q | alpha7 agonists 15q
Typen/a
Emp. Form.C19H24N5S2
Mol. Mass.386.557
SMILESC[N+]1(C)[C@H]2CC[C@@H]1C[C@H](C2)n1cc(CSc2nc3ccccc3s2)nn1