Reaction Details
TargetNeuronal acetylcholine receptor subunit alpha-7
LigandBDBM91618
Substrate/Competitorn/a
Meas. Tech.Synthesizing Selective Agonists for the ?7 Nicotinic Receptor with in situ Click-Chemistry on Acetylcholine Binding Protein Templates.
pH7.4±n/a
Temperature310.15±n/a K
EC50 400±n/a nM
Citation Yamauchi, JGGomez, KGrimster, NDufouil, MNemecz, AFotsing, JRHo, KTalley, TTSharpless, KFokin, VVTaylor, P Synthesizing Selective Agonists for the ?7 Nicotinic Receptor with in situ Click-Chemistry on Acetylcholine Binding Protein Templates. Mol Pharmacol82:687-699 (2014) 
 
Neuronal acetylcholine receptor subunit alpha-7
Name:Neuronal acetylcholine receptor subunit alpha-7
Type:n/a
Mol. Mass.:56448.33
Organism:Homo sapiens (Human)
Description: CHRNA7 (NACHRA7)
Residue:502
BDBM91618
NameBDBM91618
Synonyms:18q | alpha7 agonists 18q
Typen/a
Emp. Form.C23H33N4O
Mol. Mass.381.5338
SMILESC[N+]1(C)[C@H]2CC[C@@H]1C[C@H](C2)n1cc(COc2ccccc2C2CCCC2)nn1