Reaction Details
TargetNeuronal acetylcholine receptor subunit alpha-4
LigandBDBM91614
Substrate/Competitorn/a
Meas. Tech.Synthesizing Selective Agonists for the ?7 Nicotinic Receptor with in situ Click-Chemistry on Acetylcholine Binding Protein Templates.
pH7.4±n/a
Temperature310.15±n/a K
Ki>30000±n/a nM
Citation Yamauchi, JGGomez, KGrimster, NDufouil, MNemecz, AFotsing, JRHo, KTalley, TTSharpless, KFokin, VVTaylor, P Synthesizing Selective Agonists for the ?7 Nicotinic Receptor with in situ Click-Chemistry on Acetylcholine Binding Protein Templates. Mol Pharmacol82:687-699 (2014) 
 
Neuronal acetylcholine receptor subunit alpha-4
Name:Neuronal acetylcholine receptor subunit alpha-4
Type:n/a
Mol. Mass.:69963.49
Organism:Homo sapiens (Human)
Description:NACHRA4
Residue:627
BDBM91614
NameBDBM91614
Synonyms:14q | alpha7 agonists 14q
Typen/a
Emp. Form.C21H26N5O2
Mol. Mass.380.4629
SMILESC[N+]1(C)[C@H]2CC[C@@H]1C[C@H](C2)n1cc(COc2ccccc2-c2ccno2)nn1