Reaction Details
Target5-hydroxytryptamine receptor 3A
LigandBDBM91615
Substrate/Competitorn/a
Meas. Tech.Synthesizing Selective Agonists for the ?7 Nicotinic Receptor with in situ Click-Chemistry on Acetylcholine Binding Protein Templates.
pH7.4±n/a
Temperature310.15±n/a K
Ki>30000±n/a nM
Citation Yamauchi, JGGomez, KGrimster, NDufouil, MNemecz, AFotsing, JRHo, KTalley, TTSharpless, KFokin, VVTaylor, P Synthesizing Selective Agonists for the ?7 Nicotinic Receptor with in situ Click-Chemistry on Acetylcholine Binding Protein Templates. Mol Pharmacol82:687-699 (2014) 
 
5-hydroxytryptamine receptor 3A
Name:5-hydroxytryptamine receptor 3A
Type:n/a
Mol. Mass.:56056.00
Organism:Mus musculus (house mouse)
Description:5HT3A
Residue:487
BDBM91615
NameBDBM91615
Synonyms:15q | alpha7 agonists 15q
Typen/a
Emp. Form.C19H24N5S2
Mol. Mass.386.557
SMILESC[N+]1(C)[C@H]2CC[C@@H]1C[C@H](C2)n1cc(CSc2nc3ccccc3s2)nn1