Reaction Details
Target5-hydroxytryptamine receptor 3A
LigandBDBM91617
Substrate/Competitorn/a
Meas. Tech.Synthesizing Selective Agonists for the ?7 Nicotinic Receptor with in situ Click-Chemistry on Acetylcholine Binding Protein Templates.
pH7.4±n/a
Temperature310.15±n/a K
Ki 8000±n/a nM
Citation Yamauchi, JGGomez, KGrimster, NDufouil, MNemecz, AFotsing, JRHo, KTalley, TTSharpless, KFokin, VVTaylor, P Synthesizing Selective Agonists for the ?7 Nicotinic Receptor with in situ Click-Chemistry on Acetylcholine Binding Protein Templates. Mol Pharmacol82:687-699 (2014) 
 
5-hydroxytryptamine receptor 3A
Name:5-hydroxytryptamine receptor 3A
Type:n/a
Mol. Mass.:56056.00
Organism:Mus musculus (house mouse)
Description:5HT3A
Residue:487
BDBM91617
NameBDBM91617
Synonyms:17q | alpha7 agonists 17q
Typen/a
Emp. Form.C19H21F6N4
Mol. Mass.419.3867
SMILESC[N+]1(C)[C@H]2CC[C@@H]1C[C@H](C2)n1cc(nn1)-c1cc(cc(c1)C(F)(F)F)C(F)(F)F