Reaction Details
Target5-hydroxytryptamine receptor 3A
LigandBDBM91619
Substrate/Competitorn/a
Meas. Tech.Synthesizing Selective Agonists for the ?7 Nicotinic Receptor with in situ Click-Chemistry on Acetylcholine Binding Protein Templates.
pH7.4±n/a
Temperature310.15±n/a K
Ki>30000±n/a nM
Citation Yamauchi, JGGomez, KGrimster, NDufouil, MNemecz, AFotsing, JRHo, KTalley, TTSharpless, KFokin, VVTaylor, P Synthesizing Selective Agonists for the ?7 Nicotinic Receptor with in situ Click-Chemistry on Acetylcholine Binding Protein Templates. Mol Pharmacol82:687-699 (2014) 
 
5-hydroxytryptamine receptor 3A
Name:5-hydroxytryptamine receptor 3A
Type:n/a
Mol. Mass.:56056.00
Organism:Mus musculus (house mouse)
Description:5HT3A
Residue:487
BDBM91619
NameBDBM91619
Synonyms:19q | alpha7 agonists 19q
Typen/a
Emp. Form.C19H24F3N4O
Mol. Mass.381.4147
SMILESC[N+]1(C)[C@H]2CC[C@@H]1C[C@H](C2)n1cc(nn1)C(O)(c1ccccc1)C(F)(F)F