Reaction Details
TargetSoluble acetylcholine receptor
LigandBDBM91620
Substrate/Competitorn/a
Meas. Tech.Synthesizing Selective Agonists for the ?7 Nicotinic Receptor with in situ Click-Chemistry on Acetylcholine Binding Protein Templates.
pH7.4±n/a
Temperature293.15±n/a K
Ki 600±n/a nM
Citation Yamauchi, JGGomez, KGrimster, NDufouil, MNemecz, AFotsing, JRHo, KTalley, TTSharpless, KFokin, VVTaylor, P Synthesizing Selective Agonists for the ?7 Nicotinic Receptor with in situ Click-Chemistry on Acetylcholine Binding Protein Templates. Mol Pharmacol82:687-699 (2014) 
 
Soluble acetylcholine receptor
Name:Soluble acetylcholine receptor
Type:n/a
Mol. Mass.:26560.08
Organism:Aplysia Californica
Description:Q8WSF8
Residue:236
BDBM91620
NameBDBM91620
Synonyms:20q | alpha7 agonists 20q
Typen/a
Emp. Form.C24H27N4O
Mol. Mass.387.4968
SMILESC[N+]1(C)[C@H]2CC[C@@H]1C[C@H](C2)n1cc(nn1)C1(O)c2ccccc2-c2ccccc12