Reaction Details
TargetNeuronal acetylcholine receptor subunit alpha-4
LigandBDBM91627
Substrate/Competitorn/a
Meas. Tech.Synthesizing Selective Agonists for the ?7 Nicotinic Receptor with in situ Click-Chemistry on Acetylcholine Binding Protein Templates.
pH7.4±n/a
Temperature310.15±n/a K
Ki 20000±n/a nM
Citation Yamauchi, JGGomez, KGrimster, NDufouil, MNemecz, AFotsing, JRHo, KTalley, TTSharpless, KFokin, VVTaylor, P Synthesizing Selective Agonists for the ?7 Nicotinic Receptor with in situ Click-Chemistry on Acetylcholine Binding Protein Templates. Mol Pharmacol82:687-699 (2014) 
 
Neuronal acetylcholine receptor subunit alpha-4
Name:Neuronal acetylcholine receptor subunit alpha-4
Type:n/a
Mol. Mass.:69963.49
Organism:Homo sapiens (Human)
Description:NACHRA4
Residue:627
BDBM91627
NameBDBM91627
Synonyms:12t | alpha7 agonists 12t
Typen/a
Emp. Form.C16H21N5O2
Mol. Mass.315.3702
SMILESCN1[C@H]2CC[C@@H]1C[C@H](C2)n1cc(CNC(=O)c2ccco2)nn1