Reaction Details
TargetSoluble acetylcholine receptor
LigandBDBM91637
Substrate/Competitorn/a
Meas. Tech.Synthesizing Selective Agonists for the ?7 Nicotinic Receptor with in situ Click-Chemistry on Acetylcholine Binding Protein Templates.
pH7.4±n/a
Temperature293.15±n/a K
Ki 800±n/a nM
Citation Yamauchi, JGGomez, KGrimster, NDufouil, MNemecz, AFotsing, JRHo, KTalley, TTSharpless, KFokin, VVTaylor, P Synthesizing Selective Agonists for the ?7 Nicotinic Receptor with in situ Click-Chemistry on Acetylcholine Binding Protein Templates. Mol Pharmacol82:687-699 (2014) 
 
Soluble acetylcholine receptor
Name:Soluble acetylcholine receptor
Type:n/a
Mol. Mass.:26560.08
Organism:Aplysia Californica
Description:Q8WSF8
Residue:236
BDBM91637
NameBDBM91637
Synonyms:22t | alpha7 agonists 22t
Typen/a
Emp. Form.C23H26N4O2
Mol. Mass.390.4781
SMILESCN1[C@H]2CC[C@@H]1C[C@H](C2)n1cc(COc2ccc3ccccc3c2C(C)=O)nn1