Reaction Details
TargetDisintegrin and metalloproteinase domain-containing protein 17
LigandBDBM92459
Substrate/Competitorn/a
Meas. Tech.TACE Inhibition Assay
pH7.3±0
Temperature295.15±0 K
IC50>200000±0 nM
Citation Niu, XFan, XSun, JTing, PNarula, SLundell, D Inhibition of fucosyltransferase VII by gallic acid and its derivatives. Arch Biochem Biophys425:51-7 (2004) 
 
Disintegrin and metalloproteinase domain-containing protein 17
Name:Disintegrin and metalloproteinase domain-containing protein 17
Type:Enzyme
Mol. Mass.:93007.89
Organism:Homo sapiens (Human)
Description:
Residue:824
BDBM92459
NameBDBM92459
Synonyms:CHEMBL384759 Guanosine Diphosphate
TypeSmall molecule
Emp. Form.C10H15N5O11P2
Mol. Mass.443.2005
SMILESNc1nc2n(cnc2c(=O)[nH]1)[C@@H]1O[C@H](COP(O)(=O)OP(O)(O)=O)[C@@H](O)[C@H]1O