Reaction Details
TargetProtein kinase C delta type
LigandBDBM92594
Substrate/Competitorn/a
Meas. Tech.Binding Assay
pH7.4±0
Temperature291.15±0 K
Kd 0.177±0.004 nM
Citation Choi, SHCzifra, GKedei, NLewin, NELazar, JPu, YMarquez, VEBlumberg, PM Characterization of the interaction of phorbol esters with the C1 domain of MRCK (myotonic dystrophy kinase-related Cdc42 binding kinase) alpha/beta. J Biol Chem283:10543-9 (2008) 
 
Protein kinase C delta type
Name:Protein kinase C delta type
Type:Enzyme
Mol. Mass.:77516.79
Organism:Homo sapiens (Human)
Description:The recombinant human PKC enzymes were produced using a baculovirus expression system in SF9 cells
Residue:676
BDBM92594
NameBDBM92594
Synonyms:Phorbol ester (PDBU)
TypeSmall organic molecule
Emp. Form.C27H38O8
Mol. Mass.490.5858
SMILESCCCC(=O)O[C@@H]1[C@H](C)[C@@]2(O)C3C=C(C)C(=O)[C@@]3(O)CC(=O)CC2C2C(C)(C)[C@@]12OC(=O)CCC