Reaction Details
TargetProtein kinase C delta type
LigandBDBM92596
Substrate/Competitorn/a
Meas. Tech.Binding Assay
pH7.4±0
Temperature291.15±0 K
Ki 0.14±0.02 nM
Citation Choi, SHCzifra, GKedei, NLewin, NELazar, JPu, YMarquez, VEBlumberg, PM Characterization of the interaction of phorbol esters with the C1 domain of MRCK (myotonic dystrophy kinase-related Cdc42 binding kinase) alpha/beta. J Biol Chem283:10543-9 (2008) 
 
Protein kinase C delta type
Name:Protein kinase C delta type
Type:Enzyme
Mol. Mass.:77516.79
Organism:Homo sapiens (Human)
Description:The recombinant human PKC enzymes were produced using a baculovirus expression system in SF9 cells
Residue:676
BDBM92596
NameBDBM92596
Synonyms:Sapintoxin D
TypeSmall organic molecule
Emp. Form.C31H39NO8
Mol. Mass.553.6433
SMILESCCCC(=O)O[C@@]12C(C3CC(=O)C[C@@]4(O)C(C=C(C)C4=O)[C@]3(O)[C@@H](C)[C@H]1OC(=O)c1ccccc1NC)C2(C)C