Reaction Details
TargetRibosyldihydronicotinamide dehydrogenase [quinone]
LigandBDBM92772
Substrate/Competitorn/a
Meas. Tech.Cell Assay
IC50>1.0e+4±n/a nM
Citation Yan, CDufour, MSiegel, DReigan, PGomez, JShieh, BMoody, CJRoss, D Indolequinone inhibitors of NRH:quinone oxidoreductase 2. Characterization of the mechanism of inhibition in both cell-free and cellular systems. Biochemistry50:6678-88 (2011) 
 
Ribosyldihydronicotinamide dehydrogenase [quinone]
Name:Ribosyldihydronicotinamide dehydrogenase [quinone]
Type:Protein
Mol. Mass.:25917.25
Organism:Homo sapiens (Human)
Description:P16083
Residue:231
BDBM92772
NameBDBM92772
Synonyms:Indolequinone, compd 6
TypeSmall molecule
Emp. Form.C22H24F3N3O3
Mol. Mass.435.4395
SMILESCN(C)CCC=Nc1cc(O)c2c(COc3c(F)cc(F)cc3F)c(C)n(C)c2c1O