Reaction Details
TargetPeptidyl-prolyl cis-trans isomerase A
LigandBDBM92916
Substrate/Competitorn/a
Meas. Tech.PPIase Assay
pH7.8±n/a
Temperature278.15±n/a K
Ki 1.0e+4± 2e+3 nM
Commentsextracted
Citation Daum, SSchumann, MMathea, SAumüller, TBalsley, MAConstant, SLde Lacroix, BFKruska, FBraun, MSchiene-Fischer, C Isoform-specific inhibition of cyclophilins. Biochemistry48:6268-77 (2009) 
 
Peptidyl-prolyl cis-trans isomerase A
Name:Peptidyl-prolyl cis-trans isomerase A
Type:Protein
Mol. Mass.:18015.32
Organism:Homo sapiens (Human)
Description:P62937
Residue:165
BDBM92916
NameBDBM92916
Synonyms:Aryl 1-indanylketone, 5
TypeSmall molecule
Emp. Form.C18H15F3O2
Mol. Mass.320.3057
SMILESCOc1ccc(cc1C(=O)C1CCc2ccccc12)C(F)(F)F