Reaction Details
TargetcGMP-specific 3',5'-cyclic phosphodiesterase
LigandBDBM93138
Substrate/Competitorn/a
Meas. Tech.Phosphodiesterase Inhibition Assay
IC50 6.4e+3±n/a nM
Citation Abadi, AHLehmann, JPiazza, GAAbdel-Halim, MAli, MSM Synthesis,MolecularModeling, and Biological Evaluation of Novel Tetrahydro-ß-Carboline Hydantoin and Tetrahydro-ß-Carboline Thiohydantoin Derivatives as Phosphodiesterase 5 Inhibitors International Journal of Medicinal Chemistry2011:1-9 (2011)  
 
cGMP-specific 3',5'-cyclic phosphodiesterase
Name:cGMP-specific 3',5'-cyclic phosphodiesterase
Type:Protein
Mol. Mass.:99975.83
Organism:Homo sapiens (Human)
Description:O76074
Residue:875
BDBM93138
NameBDBM93138
Synonyms:PDE5 Inhibitor, 4
TypeSmall molecule
Emp. Form.C21H22N2O4
Mol. Mass.366.4104
SMILESCOC(=O)[C@@H]1Cc2c([nH]c3ccccc23)[C@@H](N1)c1ccc(OC)cc1OC