Reaction Details
TargetcGMP-specific 3',5'-cyclic phosphodiesterase
LigandBDBM93136
Substrate/Competitorn/a
Meas. Tech.Phosphodiesterase Inhibition Assay
IC50 7.2e+2±n/a nM
Citation Abadi, AHLehmann, JPiazza, GAAbdel-Halim, MAli, MSM Synthesis,MolecularModeling, and Biological Evaluation of Novel Tetrahydro-ß-Carboline Hydantoin and Tetrahydro-ß-Carboline Thiohydantoin Derivatives as Phosphodiesterase 5 Inhibitors International Journal of Medicinal Chemistry2011:1-9 (2011)  
 
cGMP-specific 3',5'-cyclic phosphodiesterase
Name:cGMP-specific 3',5'-cyclic phosphodiesterase
Type:Protein
Mol. Mass.:99975.83
Organism:Homo sapiens (Human)
Description:O76074
Residue:875
BDBM93136
NameBDBM93136
Synonyms:PDE5 Inhibitor, 6
TypeSmall molecule
Emp. Form.C23H23N3O4
Mol. Mass.405.4464
SMILESCCn1c(O)c2Cc3c([nH]c4ccccc34)[C@H](c3ccc(OC)cc3OC)n2c1=O