Reaction Details
TargetcGMP-specific 3',5'-cyclic phosphodiesterase
LigandBDBM93137
Substrate/Competitorn/a
Meas. Tech.Phosphodiesterase Inhibition Assay
IC50 2.4e+3±n/a nM
Citation Abadi, AHLehmann, JPiazza, GAAbdel-Halim, MAli, MSM Synthesis,MolecularModeling, and Biological Evaluation of Novel Tetrahydro-ß-Carboline Hydantoin and Tetrahydro-ß-Carboline Thiohydantoin Derivatives as Phosphodiesterase 5 Inhibitors International Journal of Medicinal Chemistry2011:1-9 (2011)  
 
cGMP-specific 3',5'-cyclic phosphodiesterase
Name:cGMP-specific 3',5'-cyclic phosphodiesterase
Type:Protein
Mol. Mass.:99975.83
Organism:Homo sapiens (Human)
Description:O76074
Residue:875
BDBM93137
NameBDBM93137
Synonyms:PDE5 Inhibitor, 9
TypeSmall molecule
Emp. Form.C25H27N3O4
Mol. Mass.433.4996
SMILESCOc1ccc([C@H]2c3[nH]c4ccccc4c3Cc3c(O)n(c(=O)n23)C(C)(C)C)c(OC)c1