Reaction Details
TargetcGMP-specific 3',5'-cyclic phosphodiesterase
LigandBDBM93141
Substrate/Competitorn/a
Meas. Tech.Phosphodiesterase Inhibition Assay
IC50 5.6e+2±n/a nM
Citation Abadi, AHLehmann, JPiazza, GAAbdel-Halim, MAli, MSM Synthesis,MolecularModeling, and Biological Evaluation of Novel Tetrahydro-ß-Carboline Hydantoin and Tetrahydro-ß-Carboline Thiohydantoin Derivatives as Phosphodiesterase 5 Inhibitors International Journal of Medicinal Chemistry2011:1-9 (2011)  
 
cGMP-specific 3',5'-cyclic phosphodiesterase
Name:cGMP-specific 3',5'-cyclic phosphodiesterase
Type:Protein
Mol. Mass.:99975.83
Organism:Homo sapiens (Human)
Description:O76074
Residue:875
BDBM93141
NameBDBM93141
Synonyms:PDE5 Inhibitor, 19
TypeSmall molecule
Emp. Form.C24H23N3O3S
Mol. Mass.433.523
SMILESCOc1ccc([C@@H]2c3[nH]c4ccccc4c3Cc3c(O)n(CC=C)c(=S)n23)c(OC)c1