Reaction Details
TargetAcetyl-CoA carboxylase 2 [151-2458]
LigandBDBM97610
Substrate/Competitorn/a
Meas. Tech.Luminometric Assay
pH7.5±0
Temperature310.15±0 K
IC50 3e+1±n/a nM
Citation Zoller, GSchmoll, DMueller, MHaschke, GFocken, I Heterocyclic compounds, processes for their preparation, medicaments comprising these compounds, and the use thereof US Patent US8470841 Publication Date 6/25/2013
 
Acetyl-CoA carboxylase 2 [151-2458]
Name:Acetyl-CoA carboxylase 2 [151-2458]
Type:Protein
Mol. Mass.:260677.17
Organism:Homo sapiens (Human)
Description:O00763 aa 1-150 removed
Residue:2308
BDBM97610
NameBDBM97610
Synonyms:CHEMBL1630715 | US8470841, 35
TypeSmall organic molecule
Emp. Form.C20H26N2O3
Mol. Mass.342.432
SMILESCC(C)Oc1ccc(Oc2ccc(CC[C@H](C)NC(C)=O)cc2)cn1