Reaction Details
TargetCoagulation factor X
LigandBDBM98168
Substrate/Competitorn/a
Meas. Tech.Inhibition Assay
IC50 167±0.0 nM
Citation Allerheiligen, SBauser, MSchirok, HRester, UHeitmeier, SGerdes, CVon Degenfeld, GDittrich-Wengenroth, ESaatmann, UStraßburger, JStraßburger, KMünter, MJLang, D Substituted oxazolidinones and their use US Patent US8487111 Publication Date 7/16/2013
 
Coagulation factor X
Name:Coagulation factor X
Type:Enzyme
Mol. Mass.:54726.60
Organism:Homo sapiens (Human)
Description:n/a
Residue:488
BDBM98168
NameBDBM98168
Synonyms:US8487111, 8
TypeSmall organic molecule
Emp. Form.C24H24ClN3O6S
Mol. Mass.517.982
SMILESCOCc1cc(ccc1-n1cccc(CCO)c1=O)N1C[C@H](CNC(=O)c2ccc(Cl)s2)OC1=O